{"text_format":"1","workbook":"xlsx","n_sheets":11,"sheets":["Übersicht","Schritt_3_Bogen_RG","Diagramm_RG","Schritt_4_1_kr_Maschinen","zu Schritt_4_1_KM","Diagramm_KM","Schritt 4_2_KM_Detail","Schritt 4_3_KM_Wirtschaft","Schritt_5_Entscheidung","Schritt6__Implementierung","Hilfstabelle"],"not_rendered":{"charts":6,"images":2,"macros":1,"external_links":1,"defined_names":3,"comments":0,"pivot_tables":0},"unopened":[{"sheet":"Diagramm_RG","index":2,"reason":"not_a_worksheet"},{"sheet":"Diagramm_KM","index":5,"reason":"not_a_worksheet"}],"bounds":{"document_bytes":16777216,"sheet_cells":100000,"rows_first":2000,"rows_last":500,"rows_between":2000,"halvings":0,"cell_chars":16384,"cell_head_chars":4096},"cells_cut":0,"cells_raw":0,"read":"whole","date_system":"1900"}

{"sheet":"Übersicht","index":0,"n_rows":2,"n_cols":11,"rows_kept":2,"cut":false,"hidden":false,"merged":[[1,1,3,3],[1,4,3,9],[0,0,0,13],[1,10,3,13]]}
["Schritt 1 und 2 Vorbereitungsphase"]
[null,"Die ersten zwei Schritte sind als Vorbereitung zum Leitfaden gedacht ",null,null,"Diese vier Punkte sind in diesem Excel-Tool enthalten",null,null,null,null,null,"Implementierung kann weiter ausgearbeitet werden, je nach dem ob erforderlich"]

{"sheet":"Schritt_3_Bogen_RG","index":1,"n_rows":32,"n_cols":6,"rows_kept":32,"cut":false,"hidden":false,"merged":[[0,0,0,5],[1,1,1,5],[3,1,3,5],[10,0,10,5],[23,0,23,1],[16,1,16,3]]}
["Schritt 3 Reifegrad des Unternehmens"]
["Fragen ↓","Entwicklungsstufen →"]
["Bewertung",1,2,3,4,5]
["Maschinen (Prozesse) erfassen, die kritisch zu bewerten sind ",1]
["Wie erfolgt die Datenverarbeitung in der Produktion","keine Verarbeitung von Daten","Speicherung von Daten zur Dokumentation","Auswertung von Daten zur Prozessüberwachung","Auswertung zur Prozessplanung/-steuerung","Automatische Prozessplanung/- steuerung"]
["Maschine zu Maschine Kommunikation (M2M)","keine Kommunikation ","Feldbus-Schnittstellen","Industrial Ethernet- Schnittstellen","Maschinen verfügen über Zugang zum Internet","Webdienste (M2M-Software)"]
["Unternehmensweite Vernetzung mit der Produktion","Keine Vernetzung der Produktion mit anderen Unternehmensbereichen","Informationsaustausch über Mail/Telekommunikation","Einheitliche Datenformate und Regeln zum Datenaustausch","Einheitliche Dateiformate und Abteilungsübergreifend vernetzte Datenserver","Abteilungsübergreifende, vollständig vernetzte IT-Lösungen"]
["IKT Infrastruktur in der Produktion","Informationsaustausch über Mail/Telekommunikation","Zentrale Datenserver in der Produktion","Internetbasierte Portale mit gemeinsamer Datennutzung","Automatisierter Informationsaustausch (z.B. Auftragsnachverfolgung)","Zulieferer/Kunden sind vollständig in Prozessgestaltung integriert"]
["Mensch-Maschine Schnittstelle","Kein Informationsaustausch zwischen Mensch Maschine","Einsatz lokaler Anzeigegeräte","Zentrale/ dezentrale Produktionsüberwachung/-steuerung","Einsatz mobiler Anzeigegeräte","Erweiterte und assistierte Realität"]
[]
{"$rows_left_out":23}
{"sheet":"Schritt_4_1_kr_Maschinen","index":3,"n_rows":107,"n_cols":17,"rows_kept":107,"cut":false,"hidden":false,"merged":[[0,0,0,13],[1,0,4,1],[1,2,4,2],[1,15,1,16],[6,13,105,13],[2,12,4,12],[2,13,4,13],[2,8,4,8],[2,9,4,9],[2,11,4,11],[1,3,4,3],[1,4,4,4],[1,5,4,5],[2,6,4,6],[2,7,4,7],[2,10,4,10]]}
["Schritt 4.1 Ermittlung der kritischen Maschinen"]
["Maschinen (Prozesse) die kritisch zu bewerten Das sind Maschinen, die mehrfach vorkommende, ungeplante Störungen oder Ausfälle aufweisen; die keine volle Leistungsauslastung haben; die ungenügendes Ersatzteilmanagement haben. ",null,null,"Bestehen an der Maschine/Anlage Probleme? Wenn ja, bitte im Schritt 4.2 benennen","Inwieweit behindert das Problem die Produktion?","Steht der fragliche Prozess im Zusammenhang mit anderen Prozessen und wird ein Ausfall auch diese beeinflussen?","Ausweichmöglichkeiten",null,null,null,null,null,null,null,null,"Zu den Spalten D und E"]
[null,null,null,null,null,null,"Ist die Maschine/Anlage redundant?","Gibt es die Möglichkeit auf andere Maschine/Anlage (durch Umrüstung) auszuweichen?","Besteht es die Möglichkeit durch Vergabe an Lieferanten den Auftrag fertigzustellen","Ist die Maschine im Schichtbetrieb (z.B vollkontinuierlich 24/7 Schichtbetrieb)?","Gibt es für die Maschine die Ersatzteilversorgung?","Mittelwert der einzelnen Maschinen","Hilfsspalte zu K","Mittelwert Ergebnis Maschinen insgesamt",null," sehr stark",1]
[null,null,null,null,null,null,null,null,null,null,null,null,null,null,null,"stark",2]
[null,null,null,null,null,null,null,null,null,null,null,null,null,null,null,"mittelmäßig",3]
["Seriennummer","Maschinenname","Baujahr",null,null,null,null,null,null,null,null,null,null,null,null,"gering",4]
[1,"Druckluftversorgung 2",2005,"nein",5,5,"nein","ja","nein","ja","ja",{"$f":"IF(ISERROR(AVERAGE(E7,F7,Hilfstabelle!I6:M6)),\"\",AVERAGE(E7,F7,Hilfstabelle!I6:M6))","v":3.2857142857142856},{"$f":"IF(ISERROR(L7+RAND()/1000),\"\",L7+RAND()/1000)","v":3.2863753399518574},{"$f":"AVERAGE($L$7:$L$106)","v":2.5833333333333335},null,"gar nicht",5]
[2,"Wasserversorgung",2006,"nein",5,5,"nein","ja","nein","ja","ja",{"$f":"IF(ISERROR(AVERAGE(E8,F8,Hilfstabelle!I7:M7)),\"\",AVERAGE(E8,F8,Hilfstabelle!I7:M7))","v":3.2857142857142856},{"$f":"IF(ISERROR(L8+RAND()/1000),\"\",L8+RAND()/1000)","v":3.2863822676937979}]
[3,"Druckluftversorgung 1",2000,"nein",5,5,"nein","nein","nein","nein","ja",{"$f":"IF(ISERROR(AVERAGE(E9,F9,Hilfstabelle!I8:M8)),\"\",AVERAGE(E9,F9,Hilfstabelle!I8:M8))","v":3.2857142857142856},3.2857452993795535]
[4,"Wasserversorgung",1997,"nein",5,5,"nein","ja","nein","ja","nein",{"$f":"IF(ISERROR(AVERAGE(E10,F10,Hilfstabelle!I9:M9)),\"\",AVERAGE(E10,F10,Hilfstabelle!I9:M9))","v":2.7142857142857144},2.714440016814081,null,null,"keine Eintragung der Werte/Auswertefeld"]
{"$rows_left_out":98}
{"sheet":"zu Schritt_4_1_KM","index":4,"n_rows":106,"n_cols":11,"rows_kept":106,"cut":false,"hidden":false,"merged":[[1,5,5,5],[1,6,5,6],[1,7,5,7],[0,0,0,7],[1,0,5,0],[1,1,5,1],[1,2,5,2],[1,3,5,3],[1,4,5,4]]}
["Automatische Sortierung der Maschinen nach dem Mittelwert der Bewertung aus dem Schritt_4_1_kritische_Maschinen zur Ermittlung der 20% der kritischen Maschinen"]
["Seriennummer","Maschinenname","Baujahr","Probleme","Mittelwert der einzelnen Maschinen","%Gesamt","kumulierte Summe % Gesamt"]
[]
[]
[]
[null,null,null,null,null,null,null,null,null,"Paretowert","% der betrachteten Maschinen für die detaillierte Auswertung"]
[{"$f":"INDEX(Schritt_4_1_kr_Maschinen!A:A,MATCH(E7,Schritt_4_1_kr_Maschinen!M:M,0))","v":11},{"$f":"INDEX(Schritt_4_1_kr_Maschinen!B:B,MATCH(E7,Schritt_4_1_kr_Maschinen!M:M,0))","v":"Schweißanlage"},{"$f":"INDEX(Schritt_4_1_kr_Maschinen!C:C,MATCH(E7,Schritt_4_1_kr_Maschinen!M:M,0))","v":2008},{"$f":"INDEX(Schritt_4_1_kr_Maschinen!D:D,MATCH(E7,Schritt_4_1_kr_Maschinen!M:M,0))","v":"ja"},{"$f":"IF(ISERROR((SMALL(Schritt_4_1_kr_Maschinen!$M$7:$M$106, ROWS($E$7:E7)))),\"\",(SMALL(Schritt_4_1_kr_Maschinen!$M$7:$M$106, ROWS($E$7:E7))))","v":1.8572916683396645},{"$f":"IF(ISERROR((SUM(E7)/SUM($E$7:$E$106))),\"\",SUM(E7)/SUM($E$7:$E$106))","v":5.9901777091936878E-2},{"$f":"SUM($F$7:F7)","v":5.9901777091936878E-2},null,null,0.8,{"$f":"1-J7","v":0.19999999999999996}]
[{"$f":"INDEX(Schritt_4_1_kr_Maschinen!A:A,MATCH(E8,Schritt_4_1_kr_Maschinen!M:M,0))","v":12},{"$f":"INDEX(Schritt_4_1_kr_Maschinen!B:B,MATCH(E8,Schritt_4_1_kr_Maschinen!M:M,0))","v":"Schweißanlage"},{"$f":"INDEX(Schritt_4_1_kr_Maschinen!C:C,MATCH(E8,Schritt_4_1_kr_Maschinen!M:M,0))","v":2019},{"$f":"INDEX(Schritt_4_1_kr_Maschinen!D:D,MATCH(E8,Schritt_4_1_kr_Maschinen!M:M,0))","v":"ja"},{"$f":"IF(ISERROR((SMALL(Schritt_4_1_kr_Maschinen!$M$7:$M$106, ROWS($E$7:E8)))),\"\",(SMALL(Schritt_4_1_kr_Maschinen!$M$7:$M$106, ROWS($E$7:E8))))","v":2.0002956965114111},{"$f":"IF(ISERROR((SUM(E8)/SUM($E$7:$E$106))),\"\",SUM(E8)/SUM($E$7:$E$106))","v":6.4513974284664724E-2},{"$f":"SUM($F$7:F8)","v":0.1244157513766016},null,null,null,{"$f":"ROUNDUP(Schritt_4_1_kr_Maschinen!B107*'zu Schritt_4_1_KM'!K7,0)","v":3}]
[{"$f":"INDEX(Schritt_4_1_kr_Maschinen!A:A,MATCH(E9,Schritt_4_1_kr_Maschinen!M:M,0))","v":8},{"$f":"INDEX(Schritt_4_1_kr_Maschinen!B:B,MATCH(E9,Schritt_4_1_kr_Maschinen!M:M,0))","v":"Kantbank"},{"$f":"INDEX(Schritt_4_1_kr_Maschinen!C:C,MATCH(E9,Schritt_4_1_kr_Maschinen!M:M,0))","v":2000},{"$f":"INDEX(Schritt_4_1_kr_Maschinen!D:D,MATCH(E9,Schritt_4_1_kr_Maschinen!M:M,0))","v":"ja"},{"$f":"IF(ISERROR((SMALL(Schritt_4_1_kr_Maschinen!$M$7:$M$106, ROWS($E$7:E9)))),\"\",(SMALL(Schritt_4_1_kr_Maschinen!$M$7:$M$106, ROWS($E$7:E9))))","v":2.1430963595701034},6.9119612501288757E-2,{"$f":"SUM($F$7:F9)","v":0.19353536387789036}]
[{"$f":"INDEX(Schritt_4_1_kr_Maschinen!A:A,MATCH(E10,Schritt_4_1_kr_Maschinen!M:M,0))","v":7},{"$f":"INDEX(Schritt_4_1_kr_Maschinen!B:B,MATCH(E10,Schritt_4_1_kr_Maschinen!M:M,0))","v":"Kantbank"},{"$f":"INDEX(Schritt_4_1_kr_Maschinen!C:C,MATCH(E10,Schritt_4_1_kr_Maschinen!M:M,0))","v":2004},{"$f":"INDEX(Schritt_4_1_kr_Maschinen!D:D,MATCH(E10,Schritt_4_1_kr_Maschinen!M:M,0))","v":"ja"},{"$f":"IF(ISERROR((SMALL(Schritt_4_1_kr_Maschinen!$M$7:$M$106, ROWS($E$7:E10)))),\"\",(SMALL(Schritt_4_1_kr_Maschinen!$M$7:$M$106, ROWS($E$7:E10))))","v":2.1432618662489653},6.9124950458893053E-2,{"$f":"SUM($F$7:F10)","v":0.26266031433678338}]
{"$rows_left_out":97}
{"sheet":"Schritt 4_2_KM_Detail","index":6,"n_rows":9,"n_cols":15,"rows_kept":9,"cut":false,"hidden":false,"merged":[[2,0,4,3],[1,0,1,3],[1,11,4,14],[1,4,4,10]]}
["Schritt 4.2 Detailierte Betrachtung der kritischen Maschinen"]
["Maschinen (Prozesse) die kritisch zu bewerten ",null,null,null," genauere Bewertung des Problems",null,null,null,null,null,null,"Verbesserungsmaßnahme"]
["Das sind Maschinen, die mehrfach vorkommende, ungeplante Störungen oder Ausfälle aufweisen; die keine volle Leistungsauslastung haben; die ungenügendes Ersatzteilmanagement haben."]
[]
[]
["Seriennummer","Maschinenname","Baujahr","Probleme","Benennen Sie die Probleme genauer","Anzahl ungeplanter Stopps (a)","Durchschnittliche Dauer pro Stopp (b) in min","Dauer der Stopps im Jahr gesamt in min","Ursachen für die Stopps","Gibt es für die Maschine/das Problem die Ersatzteile? ","Wie lange dauert die Ersatzteilversorgung?","Datum der Überprüfung","Vorgeschlagene Maßnahme","Zweck der Maßnahme","Geschätzte Kosten für die Maßnahme (d) in €"]
[11,"Schweißanlage",2008,"ja",null,8,30,null,null,null,null,null,null,null,10000]
[12,"Schweißanlage",2019,"ja",null,10,60]
[7,"Kantbank",2004,"ja",null,3,15]

{"sheet":"Schritt 4_3_KM_Wirtschaft","index":7,"n_rows":106,"n_cols":14,"rows_kept":106,"cut":false,"hidden":false,"merged":[[2,0,4,3],[1,0,1,3],[0,0,0,13],[1,5,5,5],[1,7,5,7],[1,4,5,4],[1,9,3,13],[4,9,5,9],[4,10,5,10],[4,11,5,11],[4,12,5,12],[1,6,4,6],[1,8,5,8]]}
["Schritt 4.3 Wirtschaftliche Betrachtung"]
["Maschinen (Prozesse) die kritisch zu bewerten ",null,null,null,"Wie groß ist der Einfluss der Maschine auf den Umsatz","Durchschnittlicher Umsatzverlust pro Stopp (c) in €/min","Umsatzverlust gesamt (UV) in €","Umsatzverlust gesamt pro Jahr (UVJ) in € /Jahr","Ist das Umsatzverlust gesamt pro Jahr (UVJ)  [€ /Jahr] einmallig oder wiederkehrend in jedem Jahr?","Verbesserungsmaßnahme"]
["Das sind Maschinen, die mehrfach vorkommende, ungeplante Störungen oder Ausfälle aufweisen; die keine volle Leistungsauslastung haben; die ungenügendes Ersatzteilmanagement haben."]
[]
[null,null,null,null,null,null,null,null,null,"Datum der Überprüfung","Vorgeschlagene Maßnahme","Zweck der Maßnahme","Geschätzte Kosten für die Maßnahme (d) in €","Amortisationszeit (AZ) in Jahre"]
["Seriennummer","Maschinenname","Baujahr","Probleme"]
[11,"Schweißanlage",2008,"ja",null,20,{"$f":"'Schritt 4_2_KM_Detail'!F7*'Schritt 4_2_KM_Detail'!G7*'Schritt 4_3_KM_Wirtschaft'!F7","v":4800},{"$f":"G7","v":4800},null,{"$f":"'Schritt 4_2_KM_Detail'!L7","v":0},{"$f":"'Schritt 4_2_KM_Detail'!M7","v":0},{"$f":"'Schritt 4_2_KM_Detail'!N7","v":0},{"$f":"'Schritt 4_2_KM_Detail'!O7","v":10000},{"$f":"M7/H7","v":2.0833333333333335}]
[12,"Schweißanlage",2019,"ja",null,30,{"$f":"'Schritt 4_2_KM_Detail'!F8*'Schritt 4_2_KM_Detail'!G8*'Schritt 4_3_KM_Wirtschaft'!F8","v":18000},{"$f":"G8","v":18000},null,{"$f":"'Schritt 4_2_KM_Detail'!L8","v":0},{"$f":"'Schritt 4_2_KM_Detail'!M8","v":0},{"$f":"'Schritt 4_2_KM_Detail'!N8","v":0},1000,5.5555555555555552E-2]
[7,"Kantbank",2004,"ja",null,8,{"$f":"'Schritt 4_2_KM_Detail'!F9*'Schritt 4_2_KM_Detail'!G9*'Schritt 4_3_KM_Wirtschaft'!F9","v":360},360,null,{"$f":"'Schritt 4_2_KM_Detail'!L9","v":0},{"$f":"'Schritt 4_2_KM_Detail'!M9","v":0},{"$f":"'Schritt 4_2_KM_Detail'!N9","v":0},200,0.55555555555555558]
[null,null,null,null,null,null,{"$f":"'Schritt 4_2_KM_Detail'!F10*'Schritt 4_2_KM_Detail'!G10*'Schritt 4_3_KM_Wirtschaft'!F10","v":0},0,null,{"$f":"'Schritt 4_2_KM_Detail'!L10","v":0},{"$f":"'Schritt 4_2_KM_Detail'!M10","v":0},{"$f":"'Schritt 4_2_KM_Detail'!N10","v":0},{"$f":"'Schritt 4_2_KM_Detail'!O10","v":0},{"$error":"#DIV/0!"}]
{"$rows_left_out":97}
{"sheet":"Schritt_5_Entscheidung","index":8,"n_rows":42,"n_cols":14,"rows_kept":42,"cut":false,"hidden":false,"merged":[[38,0,38,3],[38,8,40,8],[36,0,36,15],[0,0,0,15],[38,7,40,7],[39,13,40,13],[39,0,40,0],[39,1,40,1],[39,2,40,2],[39,3,40,3],[38,4,40,4],[38,5,40,5],[38,6,40,6],[39,9,40,9],[39,10,40,10],[39,11,40,11],[39,12,40,12]]}
["Schritt 6 Entscheidung"]
[]
[]
[]
[]
[]
[]
[]
[]
[]
{"$rows_left_out":33}
{"sheet":"Schritt6__Implementierung","index":9,"n_rows":6,"n_cols":2,"rows_kept":6,"cut":false,"hidden":false,"merged":[[2,1,3,1],[0,0,0,1]]}
["Schritt 6 Implementierung"]
["•Daten erfassen","Ein weiterer zu berücksichtigender Faktor für den Erfolg des PdM-Programms ist das Vorhandensein ausreichender Informationen, die umsetzbare Einblicke in das Maschinenverhalten bieten können. "]
["•Daten übertragen","Die Signalmittel liefern Daten in verschiedenen Formaten und Größen. Um diese riesigen Datenmengen zu kontrollieren und übermitteln, werden Big-Data-Datenbanken für die Speicherung und das Internet of Things für die Netzwerkübertragung hinzugezogen (vgl. Jakob Schreiner/ Julia Moßner, 2019)."]
["•Daten speichern"]
["•Daten analysieren","Predictive Analytics ist der Oberbegriff für die Analyse und Bewertung der erhobenen Daten sowie der Berechnung von Eintrittswahrscheinlichkeiten für bestimmte Ergebnisse. Es werden Regelmäßigkeiten aus der Datenmenge mit Hilfe von Algorithmen erkannt, die dann bestimmte Reparaturen oder Austauschteile diagnostizieren. "]
["•Anpassung und Optimierung","Ist der Prototyp erfolgreich, gehen Sie in eine Testproduktion. Das kann ein Testkunde sein oder ein spezifischer Case in der Produktionsanlage. Sammeln Sie Erfahrung, optimieren sie das Modell und erweitern Sie die Vorhersage in Richtung Entscheidungshilfe und Wartungsplaneinbindung. Dann kann ein solcher Service innerhalb der Firma und/oder an Ihre Kunden verkauft werden. Ein präventive Wartungsplan wird so nicht über den Haufen geworfen, sondern geht stetig, mit Bedacht, aber unabdingbar in eine zustandsorientierte und vorausschauende Wartung über."]

{"sheet":"Hilfstabelle","index":10,"n_rows":105,"n_cols":13,"rows_kept":105,"cut":false,"hidden":false,"merged":[[0,3,0,5],[10,3,10,5],[1,12,3,12],[0,8,0,12],[1,8,3,8],[1,9,3,9],[1,10,3,10],[1,11,3,11]]}
[null,null,null,"Farbendefinition Auswertung Reifegrad",null,null,null,null,"Ausweichmöglichkeiten"]
["ja",null,null,"niedrig","mittel","hoch",null,null,"Ist die Maschine/Anlage redundant?","Gibt es die Möglichkeit auf andere Maschine/Anlage auszuweichen?","Besteht es die Möglichkeit durch Vergabe an Lieferanten den Auftrag fertigzustellen","Ist die Maschine im Schichtbetrieb?","Gibt es für die Maschine die Ersatzteilversorgung?"]
["nein",null,null,1,3,5]
["nicht bekannt",null,null,1,3,5]
[null,null,null,1,3,5]
["niedrigster Wert","Höchster Wert",null,1,3,5,null,null,{"$f":"IF(Schritt_4_1_kr_Maschinen!G7=\"ja\",5,IF(Schritt_4_1_kr_Maschinen!G7=\"nein\",1,\"\"))","v":1},{"$f":"IF(Schritt_4_1_kr_Maschinen!H7=\"ja\",5,IF(Schritt_4_1_kr_Maschinen!H7=\"nein\",1,\"\"))","v":5},{"$f":"IF(Schritt_4_1_kr_Maschinen!I7=\"ja\",5,IF(Schritt_4_1_kr_Maschinen!I7=\"nein\",1,\"\"))","v":1},{"$f":"IF(Schritt_4_1_kr_Maschinen!J7=\"ja\",1,IF(Schritt_4_1_kr_Maschinen!J7=\"nein\",5,\"\"))","v":1},{"$f":"IF(Schritt_4_1_kr_Maschinen!K7=\"ja\",5,IF(Schritt_4_1_kr_Maschinen!K7=\"nein\",1,\"\"))","v":5}]
[1,5,null,1,3,5,null,null,{"$f":"IF(Schritt_4_1_kr_Maschinen!G8=\"ja\",5,IF(Schritt_4_1_kr_Maschinen!G8=\"nein\",1,\"\"))","v":1},{"$f":"IF(Schritt_4_1_kr_Maschinen!H8=\"ja\",5,IF(Schritt_4_1_kr_Maschinen!H8=\"nein\",1,\"\"))","v":5},{"$f":"IF(Schritt_4_1_kr_Maschinen!I8=\"ja\",5,IF(Schritt_4_1_kr_Maschinen!I8=\"nein\",1,\"\"))","v":1},{"$f":"IF(Schritt_4_1_kr_Maschinen!J8=\"ja\",1,IF(Schritt_4_1_kr_Maschinen!J8=\"nein\",5,\"\"))","v":1},{"$f":"IF(Schritt_4_1_kr_Maschinen!K8=\"ja\",5,IF(Schritt_4_1_kr_Maschinen!K8=\"nein\",1,\"\"))","v":5}]
[null,null,null,1,3,5,null,null,{"$f":"IF(Schritt_4_1_kr_Maschinen!G9=\"ja\",5,IF(Schritt_4_1_kr_Maschinen!G9=\"nein\",1,\"\"))","v":1},{"$f":"IF(Schritt_4_1_kr_Maschinen!H9=\"ja\",5,IF(Schritt_4_1_kr_Maschinen!H9=\"nein\",1,\"\"))","v":1},{"$f":"IF(Schritt_4_1_kr_Maschinen!I9=\"ja\",5,IF(Schritt_4_1_kr_Maschinen!I9=\"nein\",1,\"\"))","v":1},{"$f":"IF(Schritt_4_1_kr_Maschinen!J9=\"ja\",1,IF(Schritt_4_1_kr_Maschinen!J9=\"nein\",5,\"\"))","v":5},{"$f":"IF(Schritt_4_1_kr_Maschinen!K9=\"ja\",5,IF(Schritt_4_1_kr_Maschinen!K9=\"nein\",1,\"\"))","v":5}]
[null,null,null,null,null,null,null,null,{"$f":"IF(Schritt_4_1_kr_Maschinen!G10=\"ja\",5,IF(Schritt_4_1_kr_Maschinen!G10=\"nein\",1,\"\"))","v":1},{"$f":"IF(Schritt_4_1_kr_Maschinen!H10=\"ja\",5,IF(Schritt_4_1_kr_Maschinen!H10=\"nein\",1,\"\"))","v":5},{"$f":"IF(Schritt_4_1_kr_Maschinen!I10=\"ja\",5,IF(Schritt_4_1_kr_Maschinen!I10=\"nein\",1,\"\"))","v":1},{"$f":"IF(Schritt_4_1_kr_Maschinen!J10=\"ja\",1,IF(Schritt_4_1_kr_Maschinen!J10=\"nein\",5,\"\"))","v":1},{"$f":"IF(Schritt_4_1_kr_Maschinen!K10=\"ja\",5,IF(Schritt_4_1_kr_Maschinen!K10=\"nein\",1,\"\"))","v":1}]
[null,null,null,null,null,null,null,null,{"$f":"IF(Schritt_4_1_kr_Maschinen!G11=\"ja\",5,IF(Schritt_4_1_kr_Maschinen!G11=\"nein\",1,\"\"))","v":1},{"$f":"IF(Schritt_4_1_kr_Maschinen!H11=\"ja\",5,IF(Schritt_4_1_kr_Maschinen!H11=\"nein\",1,\"\"))","v":5},{"$f":"IF(Schritt_4_1_kr_Maschinen!I11=\"ja\",5,IF(Schritt_4_1_kr_Maschinen!I11=\"nein\",1,\"\"))","v":1},{"$f":"IF(Schritt_4_1_kr_Maschinen!J11=\"ja\",1,IF(Schritt_4_1_kr_Maschinen!J11=\"nein\",5,\"\"))","v":1},{"$f":"IF(Schritt_4_1_kr_Maschinen!K11=\"ja\",5,IF(Schritt_4_1_kr_Maschinen!K11=\"nein\",1,\"\"))","v":5}]
{"$rows_left_out":95}